Reaction Details
TargetTyrosine-protein kinase JAK2
LigandBDBM112565
Substrate/Competitorn/a
Meas. Tech.Inhibition Assay
pH7.2±n/a
IC50 0.0367±n/a nM
Citation de Vicente Fidalgo, JHermann, JCLemoine, RLi, HLovey, AJSjogren, EBSoth, M Inhibitors of JAK US Patent US8618103 Publication Date 12/31/2013
 
Tyrosine-protein kinase JAK2
Name:Tyrosine-protein kinase JAK2
Type:Protein
Mol. Mass.:130684.68
Organism:Homo sapiens (Human)
Description:O60674
Residue:1132
BDBM112565
NameBDBM112565
Synonyms:US8618103, I-61
TypeSmall organic molecule
Emp. Form.C18H22N6O2S
Mol. Mass.386.471
SMILESCc1c[nH]c2ncc(nc12)-c1cccnc1N[C@H]1CCCN(C1)S(C)(=O)=O