Reaction Details
TargetTyrosine-protein kinase JAK2
LigandBDBM112602
Substrate/Competitorn/a
Meas. Tech.Inhibition Assay
pH7.2±n/a
IC50 0.1373±n/a nM
Citation de Vicente Fidalgo, JHermann, JCLemoine, RLi, HLovey, AJSjogren, EBSoth, M Inhibitors of JAK US Patent US8618103 Publication Date 12/31/2013
 
Tyrosine-protein kinase JAK2
Name:Tyrosine-protein kinase JAK2
Type:Protein
Mol. Mass.:130684.68
Organism:Homo sapiens (Human)
Description:O60674
Residue:1132
BDBM112602
NameBDBM112602
Synonyms:US8618103, I-98
TypeSmall organic molecule
Emp. Form.C23H33N9O2S
Mol. Mass.499.632
SMILESCN(C)C1CCN(CC1)c1ncc(c(N[C@H]2CCCN(C2)S(C)(=O)=O)n1)-c1cnc2[nH]ccc2n1