Reaction Details
TargetGag-Pol polyprotein [484-582,Q491K,I494L,I497V,V499I,E519D,R541K,D544E,Q553K,L573M]
LigandBDBM112656
Substrate/Competitorn/a
Meas. Tech.HIV-1 protease inhibition assay
pH4.7±n/a
Temperature298.15±n/a K
Ki 0.0005±0.009 nM
Commentsextracted
Citation Nalam, MNAli, AReddy, GSCao, HAnjum, SGAltman, MDYilmaz, NKTidor, BRana, TMSchiffer, CA Substrate envelope-designed potent HIV-1 protease inhibitors to avoid drug resistance. Chem Biol20:1116-24 (2013) 
 
Gag-Pol polyprotein [484-582,Q491K,I494L,I497V,V499I,E519D,R541K,D544E,Q553K,L573M]
Name:Gag-Pol polyprotein [484-582,Q491K,I494L,I497V,V499I,E519D,R541K,D544E,Q553K,L573M]
Type:Protein
Mol. Mass.:10758.73
Organism:Human immunodeficiency virus
Description:wild-type HIV-1 protease (Q7K)
Residue:99
BDBM112656
NameBDBM112656
Synonyms:(3R,3aS,6aR)-Hexahydrofuro[2,3-b]furan-3-yl ((2S,3R)-3-hydroxy-4-(4-(hydroxymethyl)-N-((S)-2-methylbutyl)phenylsulfonamido)-1-phenylbutan-2-yl)carbamate (10c)
TypeSmall organic molecule
Emp. Form.C29H40N2O8S
Mol. Mass.576.701
SMILESCC[C@H](C)CN(C[C@@H](O)[C@H](Cc1ccccc1)NC(=O)O[C@H]1CO[C@H]2OCC[C@@H]12)S(=O)(=O)c1ccc(CO)cc1