Reaction Details
Target5-hydroxytryptamine receptor 6
LigandBDBM50314759
Substrate/Competitorn/a
Meas. Tech.Competitive Binding Assay
pH7.4±n/a
Temperature303.15±n/a K
Ki 0.458±n/a nM
IC50 0.986±n/a nM
Citation Ivashchenko, AAIvashchenko, AVSavchuk, NF Substituted cycloalcano[e and d] pyrazolo [1,5-a]pyrimidines/antagonists of serotonin 5-HT6 receptors and methods for production and the use thereof US Patent US8629154 Publication Date 1/14/2014
 
5-hydroxytryptamine receptor 6
Name:5-hydroxytryptamine receptor 6
Type:G Protein-Coupled Receptor (GPCR)
Mol. Mass.:46968.43
Organism:Homo sapiens (Human)
Description:P50406
Residue:440
BDBM50314759
NameBDBM50314759
Synonyms:2-(methylthio)-3-(phenylsulfonyl)-7,8-dihydro-6H-cyclopenta[e]pyrazolo[1,5-a]pyrimidine US8629154, 1.1(1)
TypeSmall organic molecule
Emp. Form.C16H15N3O2S2
Mol. Mass.345.439
SMILESCSc1nn2c3CCCc3cnc2c1S(=O)(=O)c1ccccc1