Reaction Details
Target5-hydroxytryptamine receptor 6
LigandBDBM50314762
Substrate/Competitorn/a
Meas. Tech.Competitive Binding Assay
pH7.4±n/a
Temperature303.15±n/a K
Ki 0.44±n/a nM
IC50 0.948±n/a nM
Citation Ivashchenko, AAIvashchenko, AVSavchuk, NF Substituted cycloalcano[e and d] pyrazolo [1,5-a]pyrimidines/antagonists of serotonin 5-HT6 receptors and methods for production and the use thereof US Patent US8629154 Publication Date 1/14/2014
 
5-hydroxytryptamine receptor 6
Name:5-hydroxytryptamine receptor 6
Type:G Protein-Coupled Receptor (GPCR)
Mol. Mass.:46968.43
Organism:Homo sapiens (Human)
Description:P50406
Residue:440
BDBM50314762
NameBDBM50314762
Synonyms:5-methyl-2-(methylthio)-3-(phenylsulfonyl)-6,7,8,9-tetrahydropyrazolo[1,5-a]quinazoline CHEMBL1091919 | US8629154, 1.2(3)
TypeSmall organic molecule
Emp. Form.C18H19N3O2S2
Mol. Mass.373.492
SMILESCSc1nn2c3CCCCc3c(C)nc2c1S(=O)(=O)c1ccccc1