Reaction Details
TargetCytohesin-3
LigandBDBM112784
Substrate/Competitorn/a
Meas. Tech.Fluorescence Polarization Assay
pH7.5±n/a
Temperature298.15±n/a K
IC50 40300±n/a nM
Citation Degterev, ARamana, CVMiao, B Small molecule antagonists of phosphatidylinositol-3,4,5-triphosphate (PIP3) and uses thereof US Patent US8628961 Publication Date 1/14/2014
 
Cytohesin-3
Name:Cytohesin-3
Type:Enzyme
Mol. Mass.:46340.05
Organism:Homo sapiens (Human)
Description:O43739
Residue:400
BDBM112784
NameBDBM112784
Synonyms:US8628961, PIT-1
TypeSmall organic molecule
Emp. Form.C14H10ClN3O4S
Mol. Mass.351.765
SMILESOc1c(Cl)cc(cc1NC(=S)NC(=O)c1ccccc1)[N+]([O-])=O