Reaction Details
TargetCytohesin-3
LigandBDBM112785
Substrate/Competitorn/a
Meas. Tech.Fluorescence Polarization Assay
pH7.5±n/a
Temperature298.15±n/a K
IC50 35500±n/a nM
Citation Degterev, ARamana, CVMiao, B Small molecule antagonists of phosphatidylinositol-3,4,5-triphosphate (PIP3) and uses thereof US Patent US8628961 Publication Date 1/14/2014
 
Cytohesin-3
Name:Cytohesin-3
Type:Enzyme
Mol. Mass.:46340.05
Organism:Homo sapiens (Human)
Description:O43739
Residue:400
BDBM112785
NameBDBM112785
Synonyms:US8628961, DM-PIT-1
TypeSmall organic molecule
Emp. Form.C16H15N3O4S
Mol. Mass.345.373
SMILESCc1cc(C)cc(c1)C(=O)NC(=S)Nc1cc(ccc1O)[N+]([O-])=O