Reaction Details
TargetTyrosine-protein kinase JAK3
LigandBDBM113216
Substrate/Competitorn/a
Meas. Tech.Enzymatic Assay
pH7.4±n/a
IC50 0.198±n/a nM
Commentsextracted
Citation Promo, MAXie, JAcker, BAHartmann, SJWolfson, SGHuang, HJacobsen, EJ Pyrrolo[2,3-D]pyrimidine compounds US Patent US8633206 Publication Date 1/21/2014
 
Tyrosine-protein kinase JAK3
Name:Tyrosine-protein kinase JAK3
Type:Protein
Mol. Mass.:125111.08
Organism:Homo sapiens (Human)
Description:P52333
Residue:1124
BDBM113216
NameBDBM113216
Synonyms:US8633206, 135
TypeSmall organic molecule
Emp. Form.C20H31N5O3S
Mol. Mass.421.557
SMILESC[C@H]1CN(C[C@@H]1CO)S(=O)(=O)C[C@H]1CC[C@@H](CC1)N(C)c1ncnc2[nH]ccc12