Reaction Details
TargetTyrosine-protein kinase JAK3
LigandBDBM113222
Substrate/Competitorn/a
Meas. Tech.Enzymatic Assay
pH7.4±n/a
IC50 0.768±n/a nM
Commentsextracted
Citation Promo, MAXie, JAcker, BAHartmann, SJWolfson, SGHuang, HJacobsen, EJ Pyrrolo[2,3-D]pyrimidine compounds US Patent US8633206 Publication Date 1/21/2014
 
Tyrosine-protein kinase JAK3
Name:Tyrosine-protein kinase JAK3
Type:Protein
Mol. Mass.:125111.08
Organism:Homo sapiens (Human)
Description:P52333
Residue:1124
BDBM113222
NameBDBM113222
Synonyms:US8633206, 141
TypeSmall organic molecule
Emp. Form.C19H30N5O6PS
Mol. Mass.487.51
SMILESCN([C@H]1CC[C@H](CS(=O)(=O)N2CCC[C@H](C2)OP(O)(O)=O)CC1)c1ncnc2[nH]ccc12