Reaction Details
TargetTyrosine-protein kinase JAK1
LigandBDBM113173
Substrate/Competitorn/a
Meas. Tech.Enzymatic Assay
pH7.4±n/a
IC50 1.92±n/a nM
Commentsextracted
Citation Promo, MAXie, JAcker, BAHartmann, SJWolfson, SGHuang, HJacobsen, EJ Pyrrolo[2,3-D]pyrimidine compounds US Patent US8633206 Publication Date 1/21/2014
 
Tyrosine-protein kinase JAK1
Name:Tyrosine-protein kinase JAK1
Type:Protein
Mol. Mass.:133293.73
Organism:Homo sapiens (Human)
Description:P23458
Residue:1154
BDBM113173
NameBDBM113173
Synonyms:US8633206, 91
TypeSmall organic molecule
Emp. Form.C24H31N5O3S
Mol. Mass.469.6
SMILESCN([C@H]1CC[C@H](CS(=O)(=O)N2CC[C@](O)(C2)c2ccccc2)CC1)c1ncnc2[nH]ccc12