Reaction Details
TargetProstaglandin G/H synthase 2
LigandBDBM113764
Substrate/Competitorn/a
Meas. Tech.COX-2 Activity Assay
pH8±n/a
Temperature298.15±n/a K
IC50>5.0e+4±n/a nM
Commentsextracted
Citation Chicca, ACaprioglio, DMinassi, APetrucci, VAppendino, GTaglialatela-Scafati, OGertsch, J Functionalization of ß-Caryophyllene Generates Novel Polypharmacology in the Endocannabinoid System. ACS Chem Biol9:1499-507 (2014) 
 
Prostaglandin G/H synthase 2
Name:Prostaglandin G/H synthase 2
Type:Enzyme
Mol. Mass.:69003.89
Organism:Homo sapiens (Human)
Description:Recombinant Cox-2 provided by Cayman (Cayman Chemical Co.,Ann Arbor, MI).
Residue:604
BDBM113764
NameBDBM113764
Synonyms:(E)-6-((1R,2R)-3,3-Dimethyl-2-(3-methylbut-3-enyl)cyclobutyl)-N-propylhepta-2,6-dienamide (11a)
TypeSmall organic molecule
Emp. Form.C21H35NO
Mol. Mass.317.5087
SMILESCCCNC(=O)\C=C\CCC(=C)[C@@H]1CC(C)(C)[C@@H]1CCC(C)=C