Reaction Details
TargetProstaglandin G/H synthase 2
LigandBDBM50029600
Substrate/Competitorn/a
Meas. Tech.COX-2 Activity Assay
pH8±n/a
Temperature298.15±n/a K
IC50 68± 7 nM
Commentsextracted
Citation Chicca, ACaprioglio, DMinassi, APetrucci, VAppendino, GTaglialatela-Scafati, OGertsch, J Functionalization of ß-Caryophyllene Generates Novel Polypharmacology in the Endocannabinoid System. ACS Chem Biol9:1499-507 (2014) 
 
Prostaglandin G/H synthase 2
Name:Prostaglandin G/H synthase 2
Type:Enzyme
Mol. Mass.:69003.89
Organism:Homo sapiens (Human)
Description:Recombinant Cox-2 provided by Cayman (Cayman Chemical Co.,Ann Arbor, MI).
Residue:604
BDBM50029600
NameBDBM50029600
Synonyms:5-Bromo-2-(4-fluoro-phenyl)-3-(4-methanesulfonyl-phenyl)-thiophene CHEMBL42485 | DUP-697
TypeSmall organic molecule
Emp. Form.C17H12BrFO2S2
Mol. Mass.411.308
SMILESCS(=O)(=O)c1ccc(cc1)-c1cc(Br)sc1-c1ccc(F)cc1