Reaction Details
TargetAcyl-homoserine lactone acylase PvdQ [A190E,F674L]
LigandBDBM113777
Substrate/Competitorn/a
Meas. Tech.PvdQ IC50 Assay
IC50 7e+1± 2e+1 nM
Citation Wurst, JMDrake, EJTheriault, JRJewett, ITVerPlank, LPerez, JRDandapani, SPalmer, MMoskowitz, SMSchreiber, SLMunoz, BGulick, AM Identification of Inhibitors of PvdQ, an Enzyme Involved in the Synthesis of the Siderophore Pyoverdine. ACS Chem Biol9:1536-44 (2014) 
 
Acyl-homoserine lactone acylase PvdQ [A190E,F674L]
Name:Acyl-homoserine lactone acylase PvdQ [A190E,F674L]
Type:Protein
Mol. Mass.:84038.62
Organism:Pseudomonas aeruginosa
Description:Ntn hydrolase
Residue:762
BDBM113777
NameBDBM113777
Synonyms:2-(6-Chloropyridin-2-yl)-2-(4-fluorophenyl)acetonitrile (9)
TypeSmall organic molecule
Emp. Form.C13H8ClFN2
Mol. Mass.246.667
SMILESFc1ccc(cc1)C(C#N)c1cccc(Cl)n1