Reaction Details
TargetAcyl-homoserine lactone acylase PvdQ [A190E,F674L]
LigandBDBM113780
Substrate/Competitorn/a
Meas. Tech.PvdQ IC50 Assay
IC50 2.5e+2± 4e+1 nM
Citation Wurst, JMDrake, EJTheriault, JRJewett, ITVerPlank, LPerez, JRDandapani, SPalmer, MMoskowitz, SMSchreiber, SLMunoz, BGulick, AM Identification of Inhibitors of PvdQ, an Enzyme Involved in the Synthesis of the Siderophore Pyoverdine. ACS Chem Biol9:1536-44 (2014) 
 
Acyl-homoserine lactone acylase PvdQ [A190E,F674L]
Name:Acyl-homoserine lactone acylase PvdQ [A190E,F674L]
Type:Protein
Mol. Mass.:84038.62
Organism:Pseudomonas aeruginosa
Description:Ntn hydrolase
Residue:762
BDBM113780
NameBDBM113780
Synonyms:2-(6-Chloropyridin-2-yl)-2-(2,4-dichlorophenyl) acetonitrile (12)
TypeSmall organic molecule
Emp. Form.C13H7Cl3N2
Mol. Mass.297.567
SMILESClc1ccc(C(C#N)c2cccc(Cl)n2)c(Cl)c1