Reaction Details
TargetAcyl-homoserine lactone acylase PvdQ [A190E,F674L]
LigandBDBM113799
Substrate/Competitorn/a
Meas. Tech.PvdQ IC50 Assay
IC50 1e+1± 1 nM
Citation Wurst, JMDrake, EJTheriault, JRJewett, ITVerPlank, LPerez, JRDandapani, SPalmer, MMoskowitz, SMSchreiber, SLMunoz, BGulick, AM Identification of Inhibitors of PvdQ, an Enzyme Involved in the Synthesis of the Siderophore Pyoverdine. ACS Chem Biol9:1536-44 (2014) 
 
Acyl-homoserine lactone acylase PvdQ [A190E,F674L]
Name:Acyl-homoserine lactone acylase PvdQ [A190E,F674L]
Type:Protein
Mol. Mass.:84038.62
Organism:Pseudomonas aeruginosa
Description:Ntn hydrolase
Residue:762
BDBM113799
NameBDBM113799
Synonyms:2-(4-Chloro-2-fluorophenyl)-2-(5-(trifluoromethyl)-pyridin-2-yl)acetonitrile (31)
TypeSmall organic molecule
Emp. Form.C14H7ClF4N2
Mol. Mass.314.665
SMILESFc1cc(Cl)ccc1C(C#N)c1ccc(cn1)C(F)(F)F