Reaction Details
TargetAcyl-homoserine lactone acylase PvdQ [A190E,F674L]
LigandBDBM113813
Substrate/Competitorn/a
Meas. Tech.PvdQ IC50 Assay
IC50 2.6e+2± 2.9e+2 nM
Citation Wurst, JMDrake, EJTheriault, JRJewett, ITVerPlank, LPerez, JRDandapani, SPalmer, MMoskowitz, SMSchreiber, SLMunoz, BGulick, AM Identification of Inhibitors of PvdQ, an Enzyme Involved in the Synthesis of the Siderophore Pyoverdine. ACS Chem Biol9:1536-44 (2014) 
 
Acyl-homoserine lactone acylase PvdQ [A190E,F674L]
Name:Acyl-homoserine lactone acylase PvdQ [A190E,F674L]
Type:Protein
Mol. Mass.:84038.62
Organism:Pseudomonas aeruginosa
Description:Ntn hydrolase
Residue:762
BDBM113813
NameBDBM113813
Synonyms:2-(4-Chlorophenyl)-2-(pyrrolidin-1-yl)acetonitrile (45)
TypeSmall organic molecule
Emp. Form.C12H13ClN2
Mol. Mass.220.698
SMILESClc1ccc(cc1)C(C#N)N1CCCC1