Reaction Details
TargetTyrosyl-DNA phosphodiesterase 2
LigandBDBM71178
Substrate/Competitorn/a
Meas. Tech.Epi Absorbance-based biochemical high throughput dose response assay to identify inhibitors of human tyrosyl-DNA phosphodiesterase 2 (TDP2)
IC50 40111±n/a nM
Citation PubChem, PC Epi Absorbance-based biochemical high throughput dose response assay to identify inhibitors of human tyrosyl-DNA phosphodiesterase 2 (TDP2) PubChem Bioassay(2014)[AID]
 
Tyrosyl-DNA phosphodiesterase 2
Name:Tyrosyl-DNA phosphodiesterase 2
Type:Enzyme Catalytic Domain
Mol. Mass.:40916.54
Organism:Homo sapiens (Human)
Description:gi_23510348
Residue:362
BDBM71178
NameBDBM71178
Synonyms:4-(3-Benzotriazol-1-yl-1,4-dioxo-1,4-dihydro-naphthalen-2-ylamino)-benzoic acid 4-[[3-(benzotriazol-1-yl)-1,4-bis(oxidanylidene)naphthalen-2-yl]amino]benzoic acid 4-[[3-(benzotriazol-1-yl)-1,4-dioxonaphthalen-2-yl]amino]benzoic acid SMR000415241 | cid_1397082
TypeSmall organic molecule
Emp. Form.C23H14N4O4
Mol. Mass.410.3817
SMILESOC(=O)c1ccc(NC2=C(C(=O)c3ccccc3C2=O)n2nnc3ccccc23)cc1