Reaction Details
Target1-phosphatidylinositol 4,5-bisphosphate phosphodiesterase beta-3
LigandBDBM18136
Substrate/Competitorn/a
Meas. Tech.Fluorescence-based biochemical high throughput dose response assay to identify inhibitors of phospholipase C isozymes (PLC-B3)
IC50 122493±n/a nM
Citation PubChem, PC Fluorescence-based biochemical high throughput dose response assay to identify inhibitors of phospholipase C isozymes (PLC-B3) PubChem Bioassay(2014)[AID]
 
1-phosphatidylinositol 4,5-bisphosphate phosphodiesterase beta-3
Name:1-phosphatidylinositol 4,5-bisphosphate phosphodiesterase beta-3
Type:PROTEIN
Mol. Mass.:138786.29
Organism:Homo sapiens (Human)
Description:EBI_12586
Residue:1234
BDBM18136
NameBDBM18136
Synonyms:ADP, alpha beta-me [({[(2R,3S,4R,5R)-5-(6-amino-9H-purin-9-yl)-3,4-dihydroxyoxolan-2-yl]methoxy}(hydroxy)phosphoryl)methyl]phosphonic acid cid_92199
TypeNucleoside or nucleotide
Emp. Form.C11H17N5O9P2
Mol. Mass.425.2283
SMILESNc1ncnc2n(cnc12)[C@@H]1O[C@H](COP(O)(=O)CP(O)(O)=O)[C@@H](O)[C@H]1O