Reaction Details
TargetMajor prion protein
LigandBDBM114306
Substrate/Competitorn/a
Meas. Tech.TRFRET-based cell-based high throughput dose response assay to identify inhibitors of cell surface Prion Protein (PRPC)
IC50 1078±n/a nM
Citation PubChem, PC TRFRET-based cell-based high throughput dose response assay to identify inhibitors of cell surface Prion Protein (PRPC) PubChem Bioassay(2014)[AID]
 
Major prion protein
Name:Major prion protein
Type:PROTEIN
Mol. Mass.:27671.97
Organism:Homo sapiens (Human)
Description:ChEMBL_158887
Residue:253
BDBM114306
NameBDBM114306
Synonyms:(2-Ethyl-quinazolin-4-ylsulfanyl)-acetic acid ethyl ester 2-[(2-ethylquinazolin-4-yl)thio]acetic acid ethyl ester SMR000003743 ethyl 2-(2-ethylquinazolin-4-yl)sulfanylacetate | ethyl 2-(2-ethylquinazolin-4-yl)sulfanylethanoate
TypeSmall organic molecule
Emp. Form.C14H16N2O2S
Mol. Mass.276.354
SMILESCCOC(=O)CSc1nc(CC)nc2ccccc12