Reaction Details
TargetMajor prion protein
LigandBDBM54184
Substrate/Competitorn/a
Meas. Tech.TRFRET-based cell-based high throughput dose response assay to identify inhibitors of cell surface Prion Protein (PRPC)
IC50 1364±n/a nM
Citation PubChem, PC TRFRET-based cell-based high throughput dose response assay to identify inhibitors of cell surface Prion Protein (PRPC) PubChem Bioassay(2014)[AID]
 
Major prion protein
Name:Major prion protein
Type:PROTEIN
Mol. Mass.:27671.97
Organism:Homo sapiens (Human)
Description:ChEMBL_158887
Residue:253
BDBM54184
NameBDBM54184
Synonyms:6,8-bis(bromanyl)-2-methyl-quinolin-3-ol 6,8-dibromo-2-methyl-quinolin-3-ol MLS000544929 cid_1472973
TypeSmall organic molecule
Emp. Form.C10H7Br2NO
Mol. Mass.316.977
SMILESCc1nc2c(Br)cc(Br)cc2cc1O