Reaction Details
TargetMajor prion protein
LigandBDBM114361
Substrate/Competitorn/a
Meas. Tech.TRFRET-based cell-based high throughput dose response assay to identify inhibitors of cell surface Prion Protein (PRPC)
IC50 1722±n/a nM
Citation PubChem, PC TRFRET-based cell-based high throughput dose response assay to identify inhibitors of cell surface Prion Protein (PRPC) PubChem Bioassay(2014)[AID]
 
Major prion protein
Name:Major prion protein
Type:PROTEIN
Mol. Mass.:27671.97
Organism:Homo sapiens (Human)
Description:ChEMBL_158887
Residue:253
BDBM114361
NameBDBM114361
Synonyms:MLS000677348 N'-[2-(2-ethylquinazolin-4-yl)sulfanylethanoyl]-4-methoxy-benzohydrazide N'-[2-[(2-ethylquinazolin-4-yl)thio]acetyl]-4-methoxy-benzohydrazide cid_1435001
TypeSmall organic molecule
Emp. Form.C20H20N4O3S
Mol. Mass.396.463
SMILESCCc1nc(SCC(=O)NNC(=O)c2ccc(OC)cc2)c2ccccc2n1