Reaction Details
TargetMajor prion protein
LigandBDBM78382
Substrate/Competitorn/a
Meas. Tech.TRFRET-based cell-based high throughput dose response assay to identify inhibitors of cell surface Prion Protein (PRPC)
IC50 1441±n/a nM
Citation PubChem, PC TRFRET-based cell-based high throughput dose response assay to identify inhibitors of cell surface Prion Protein (PRPC) PubChem Bioassay(2014)[AID]
 
Major prion protein
Name:Major prion protein
Type:PROTEIN
Mol. Mass.:27671.97
Organism:Homo sapiens (Human)
Description:ChEMBL_158887
Residue:253
BDBM78382
NameBDBM78382
Synonyms:6-bromo-5-hydroxy-2-phenyl-3-benzofurancarboxylic acid ethyl ester MLS001197117 cid_979431 ethyl 6-bromo-5-hydroxy-2-phenyl-1-benzofuran-3-carboxylate
TypeSmall organic molecule
Emp. Form.C17H13BrO4
Mol. Mass.361.187
SMILESCCOC(=O)c1c(oc2cc(Br)c(O)cc12)-c1ccccc1