Reaction Details
TargetMajor prion protein
LigandBDBM66192
Substrate/Competitorn/a
Meas. Tech.TRFRET-based cell-based high throughput dose response assay to identify inhibitors of cell surface Prion Protein (PRPC)
IC50 1410±n/a nM
Citation PubChem, PC TRFRET-based cell-based high throughput dose response assay to identify inhibitors of cell surface Prion Protein (PRPC) PubChem Bioassay(2014)[AID]
 
Major prion protein
Name:Major prion protein
Type:PROTEIN
Mol. Mass.:27671.97
Organism:Homo sapiens (Human)
Description:ChEMBL_158887
Residue:253
BDBM66192
NameBDBM66192
Synonyms:6-bromanyl-2-thiophen-2-yl-quinoline-4-carboxylic acid 6-bromo-2-thiophen-2-yl-4-quinolinecarboxylic acid MLS001182077 cid_755656
TypeSmall organic molecule
Emp. Form.C14H8BrNO2S
Mol. Mass.334.188
SMILESOC(=O)c1cc(nc2ccc(Br)cc12)-c1cccs1