Reaction Details
TargetMajor prion protein
LigandBDBM114430
Substrate/Competitorn/a
Meas. Tech.TRFRET-based cell-based high throughput dose response assay to identify inhibitors of cell surface Prion Protein (PRPC)
IC50 2046±n/a nM
Citation PubChem, PC TRFRET-based cell-based high throughput dose response assay to identify inhibitors of cell surface Prion Protein (PRPC) PubChem Bioassay(2014)[AID]
 
Major prion protein
Name:Major prion protein
Type:PROTEIN
Mol. Mass.:27671.97
Organism:Homo sapiens (Human)
Description:ChEMBL_158887
Residue:253
BDBM114430
NameBDBM114430
Synonyms:2-(2-Isopropyl-quinazolin-4-ylsulfanyl)-N-(4-methyl-thiazol-2-yl)-acetamide MLS001221905 N-(4-methyl-1,3-thiazol-2-yl)-2-(2-propan-2-ylquinazolin-4-yl)sulfanylacetamide SMR000601897 | cid_1442810
TypeSmall organic molecule
Emp. Form.C17H18N4OS2
Mol. Mass.358.481
SMILESCC(C)c1nc(SCC(=O)Nc2nc(C)cs2)c2ccccc2n1