Reaction Details
TargetMethyl-CpG-binding domain protein 2
LigandBDBM79511
Substrate/Competitorn/a
Meas. Tech.TRFRET-based biochemical high throughput dose response assay to identify inhibitors of 5-meCpG-binding domain protein 2 (MBD2)-DBD binding to methylated oligonucleotide
IC50 4409±n/a nM
Citation PubChem, PC TRFRET-based biochemical high throughput dose response assay to identify inhibitors of 5-meCpG-binding domain protein 2 (MBD2)-DBD binding to methylated oligonucleotide PubChem Bioassay(2013)[AID]
 
Methyl-CpG-binding domain protein 2
Name:Methyl-CpG-binding domain protein 2
Type:Enzyme Catalytic Domain
Mol. Mass.:43278.74
Organism:Homo sapiens (Human)
Description:gi_21595776
Residue:411
BDBM79511
NameBDBM79511
Synonyms:MLS001116571 N-[(2-chlorophenyl)methyl]-2-methyl-3-[(3-oxidanylidene-4H-1,4-benzothiazin-6-yl)sulfonyl]propanamide SMR000630020 | cid_20923253
TypeSmall organic molecule
Emp. Form.C19H19ClN2O4S2
Mol. Mass.438.948
SMILESCC(CS(=O)(=O)c1ccc2SCC(=O)Nc2c1)C(=O)NCc1ccccc1Cl