Reaction Details
TargetFibrinogen beta chain [164-491]
LigandBDBM94217
Substrate/Competitorn/a
Meas. Tech.Fluorescence polarization-based biochemical high throughput dose response assay to identify inhibitors that disrupt the binding of a cyclic peptide (Tn6) to the fibrin proteolytic product D-Dimer
IC50 10587±n/a nM
Citation PubChem, PC Fluorescence polarization-based biochemical high throughput dose response assay to identify inhibitors that disrupt the binding of a cyclic peptide (Tn6) to the fibrin proteolytic product D-Dimer and fragment E complex [DD(E )] PubChem Bioassay(2013)[AID]
 
Fibrinogen beta chain [164-491]
Name:Fibrinogen beta chain [164-491]
Type:Enzyme Catalytic Domain
Mol. Mass.:37647.12
Organism:Homo sapiens (Human)
Description:gi_28373962
Residue:328
BDBM94217
NameBDBM94217
Synonyms:MLS000529731 N-[(1,2-dimethylindol-5-yl)methyl]-4-morpholin-4-ylsulfonyl-benzamide N-[(1,2-dimethylindol-5-yl)methyl]-4-morpholinosulfonyl-benzamide cid_3251511
TypeSmall organic molecule
Emp. Form.C22H25N3O4S
Mol. Mass.427.517
SMILESCc1cc2cc(CNC(=O)c3ccc(cc3)S(=O)(=O)N3CCOCC3)ccc2n1C