Reaction Details
TargetFibrinogen beta chain [164-491]
LigandBDBM52976
Substrate/Competitorn/a
Meas. Tech.Fluorescence polarization-based biochemical high throughput dose response assay to identify inhibitors that disrupt the binding of a cyclic peptide (Tn6) to the fibrin proteolytic product D-Dimer
IC50 16011±n/a nM
Citation PubChem, PC Fluorescence polarization-based biochemical high throughput dose response assay to identify inhibitors that disrupt the binding of a cyclic peptide (Tn6) to the fibrin proteolytic product D-Dimer and fragment E complex [DD(E )] PubChem Bioassay(2013)[AID]
 
Fibrinogen beta chain [164-491]
Name:Fibrinogen beta chain [164-491]
Type:Enzyme Catalytic Domain
Mol. Mass.:37647.12
Organism:Homo sapiens (Human)
Description:gi_28373962
Residue:328
BDBM52976
NameBDBM52976
Synonyms:(3-cyclopropyl-7-methyl-6,8-dioxoisochromen-7-yl) furan-2-carboxylate CMLD003316 SMR000452580 cid_16759460 | furan-2-carboxylic acid (3-cyclopropyl-6,8-diketo-7-methyl-isochromen-7-yl) ester
TypeSmall organic molecule
Emp. Form.C18H14O6
Mol. Mass.326.3002
SMILESCC1(OC(=O)c2ccco2)C(=O)C=C2C=C(OC=C2C1=O)C1CC1