Reaction Details
TargetFibrinogen beta chain [164-491]
LigandBDBM114667
Substrate/Competitorn/a
Meas. Tech.Fluorescence polarization-based biochemical high throughput dose response assay to identify inhibitors that disrupt the binding of a cyclic peptide (Tn6) to the fibrin proteolytic product D-Dimer
IC50 22335±n/a nM
Citation PubChem, PC Fluorescence polarization-based biochemical high throughput dose response assay to identify inhibitors that disrupt the binding of a cyclic peptide (Tn6) to the fibrin proteolytic product D-Dimer and fragment E complex [DD(E )] PubChem Bioassay(2013)[AID]
 
Fibrinogen beta chain [164-491]
Name:Fibrinogen beta chain [164-491]
Type:Enzyme Catalytic Domain
Mol. Mass.:37647.12
Organism:Homo sapiens (Human)
Description:gi_28373962
Residue:328
BDBM114667
NameBDBM114667
Synonyms:5-keto-1H-benzo[cd]indole-2-carboxylic acid ethyl ester MLS003170860 cid_5384472 ethyl 5-oxo-1H-benzo[cd]indole-2-carboxylate
TypeSmall organic molecule
Emp. Form.C14H11NO3
Mol. Mass.241.242
SMILESCCOC(=O)c1[nH]c2cccc3C(=O)C=Cc1c23