Reaction Details
TargetFibrinogen beta chain [164-491]
LigandBDBM50306771
Substrate/Competitorn/a
Meas. Tech.Fluorescence polarization-based biochemical high throughput dose response assay to identify inhibitors that disrupt the binding of a cyclic peptide (Tn7) to the fibrin proteolytic product D-Dimer
IC50 83238±n/a nM
Citation PubChem, PC Fluorescence polarization-based biochemical high throughput dose response assay to identify inhibitors that disrupt the binding of a cyclic peptide (Tn7) to the fibrin proteolytic product D-Dimer and fragment E complex [DD(E )] PubChem Bioassay(2013)[AID]
 
Fibrinogen beta chain [164-491]
Name:Fibrinogen beta chain [164-491]
Type:Enzyme Catalytic Domain
Mol. Mass.:37647.12
Organism:Homo sapiens (Human)
Description:gi_28373962
Residue:328
BDBM50306771
NameBDBM50306771
Synonyms:1-amino-4-methoxyanthracene-9,10-dione cid_8321
TypeSmall organic molecule
Emp. Form.C15H11NO3
Mol. Mass.253.2527
SMILESCOc1ccc(N)c2C(=O)c3ccccc3C(=O)c12