Reaction Details
TargetFibrinogen beta chain [164-491]
LigandBDBM50241461
Substrate/Competitorn/a
Meas. Tech.Fluorescence polarization-based biochemical high throughput dose response assay to identify inhibitors that disrupt the binding of a cyclic peptide (Tn7) to the fibrin proteolytic product D-Dimer
IC50 83278±n/a nM
Citation PubChem, PC Fluorescence polarization-based biochemical high throughput dose response assay to identify inhibitors that disrupt the binding of a cyclic peptide (Tn7) to the fibrin proteolytic product D-Dimer and fragment E complex [DD(E )] PubChem Bioassay(2013)[AID]
 
Fibrinogen beta chain [164-491]
Name:Fibrinogen beta chain [164-491]
Type:Enzyme Catalytic Domain
Mol. Mass.:37647.12
Organism:Homo sapiens (Human)
Description:gi_28373962
Residue:328
BDBM50241461
NameBDBM50241461
Synonyms:3,7-bis(dimethylamino)phenothiazin-5-ium chloride CHEMBL405110 Methylene Blue anhydrous Methylene blue (10) azul de metileno cid_6099 | methylthioninium chloride
TypeSmall organic molecule
Emp. Form.C16H18N3S
Mol. Mass.284.399
SMILESCN(C)c1ccc2nc3ccc(cc3sc2c1)=[N+](C)C