Reaction Details
TargetFibrinogen beta chain [164-491]
LigandBDBM114661
Substrate/Competitorn/a
Meas. Tech.Fluorescence polarization-based biochemical high throughput dose response assay to identify inhibitors that disrupt the binding of a cyclic peptide (Tn7) to the fibrin proteolytic product D-Dimer
IC50 83254±n/a nM
Citation PubChem, PC Fluorescence polarization-based biochemical high throughput dose response assay to identify inhibitors that disrupt the binding of a cyclic peptide (Tn7) to the fibrin proteolytic product D-Dimer and fragment E complex [DD(E )] PubChem Bioassay(2013)[AID]
 
Fibrinogen beta chain [164-491]
Name:Fibrinogen beta chain [164-491]
Type:Enzyme Catalytic Domain
Mol. Mass.:37647.12
Organism:Homo sapiens (Human)
Description:gi_28373962
Residue:328
BDBM114661
NameBDBM114661
Synonyms:2-(3,4-dihydro-1H-isoquinolin-2-yl)benzo[cd]indole SMR000354752 | cid_2327752
TypeSmall organic molecule
Emp. Form.C20H16N2
Mol. Mass.284.3544
SMILESC1Cc2ccccc2CN1C1=Nc2cccc3cccc1c23