Reaction Details
TargetTegument protein VP16
LigandBDBM36871
Substrate/Competitorn/a
Meas. Tech.Counterscreen for inhibitors of COUP-TFII (NR2F2): Luminescence-based cell-based high throughput dose response assay to identify inhibitors of the Herpes Virus Virion Protein 16 (VP16)
IC50 30469±n/a nM
Citation PubChem, PC Counterscreen for inhibitors of COUP-TFII (NR2F2): Luminescence-based cell-based high throughput dose response assay to identify inhibitors of the Herpes Virus Virion Protein 16 (VP16) PubChem Bioassay(2013)[AID]
 
Tegument protein VP16
Name:Tegument protein VP16
Type:PROTEIN
Mol. Mass.:54325.13
Organism:Human herpesvirus 1 (strain 17) (HHV-1) (Human herpes simplex virus1)
Description:EBI_100271
Residue:490
BDBM36871
NameBDBM36871
Synonyms:MLS000027766 N-[4-(1-mesyl-2-methyl-indolin-5-yl)thiazol-2-yl]-2-(2-thienyl)acetamide N-[4-(2-methyl-1-methylsulfonyl-2,3-dihydroindol-5-yl)-1,3-thiazol-2-yl]-2-thiophen-2-ylacetamide SMR000007522 | cid_654842
TypeSmall organic molecule
Emp. Form.C19H19N3O3S3
Mol. Mass.433.567
SMILESCC1Cc2cc(ccc2N1S(C)(=O)=O)-c1csc(NC(=O)Cc2cccs2)n1