Reaction Details
TargetOxysterols receptor LXR-beta
LigandBDBM39435
Substrate/Competitorn/a
Meas. Tech.Counterscreen for agonists of the daf-12 abnormal Dauer Formation: Luminescence-based cell-based dose response screening assay to identify agonists of the Liver-X-Receptor (LXR)
EC50 67533±n/a nM
Citation PubChem, PC Counterscreen for agonists of the daf-12 abnormal Dauer Formation: Luminescence-based cell-based dose response screening assay to identify agonists of the Liver-X-Receptor (LXR) PubChem Bioassay(2013)[AID]
 
Oxysterols receptor LXR-beta
Name:Oxysterols receptor LXR-beta
Type:Enzyme Catalytic Domain
Mol. Mass.:50978.79
Organism:Homo sapiens (Human)
Description:P55055
Residue:460
BDBM39435
NameBDBM39435
Synonyms:2-[(3-cyano-6-pyridin-4-yl-2-pyridinyl)thio]acetic acid ethyl ester MLS000027979 cid_657961 ethyl 2-(3-cyano-6-pyridin-4-ylpyridin-2-yl)sulfanylacetate
TypeSmall organic molecule
Emp. Form.C15H13N3O2S
Mol. Mass.299.348
SMILESCCOC(=O)CSc1nc(ccc1C#N)-c1ccncc1