Reaction Details
TargetOxysterols receptor LXR-beta
LigandBDBM37328
Substrate/Competitorn/a
Meas. Tech.Counterscreen for agonists of the daf-12 abnormal Dauer Formation: Luminescence-based cell-based dose response screening assay to identify agonists of the Liver-X-Receptor (LXR)
EC50 67520±n/a nM
Citation PubChem, PC Counterscreen for agonists of the daf-12 abnormal Dauer Formation: Luminescence-based cell-based dose response screening assay to identify agonists of the Liver-X-Receptor (LXR) PubChem Bioassay(2013)[AID]
 
Oxysterols receptor LXR-beta
Name:Oxysterols receptor LXR-beta
Type:Enzyme Catalytic Domain
Mol. Mass.:50978.79
Organism:Homo sapiens (Human)
Description:P55055
Residue:460
BDBM37328
NameBDBM37328
Synonyms:2-(4,6-dimethyl-2-pyrimidinyl)-4-[(4-fluorophenyl)thio]-5-methyl-3-pyrazolamine 2-(4,6-dimethylpyrimidin-2-yl)-4-(4-fluorophenyl)sulfanyl-5-methylpyrazol-3-amine SMR000060530 cid_2321431
TypeSmall organic molecule
Emp. Form.C16H16FN5S
Mol. Mass.329.395
SMILESCc1nn(c(N)c1Sc1ccc(F)cc1)-c1nc(C)cc(C)n1