Reaction Details
TargetOxysterols receptor LXR-beta
LigandBDBM37183
Substrate/Competitorn/a
Meas. Tech.Counterscreen for agonists of the daf-12 abnormal Dauer Formation: Luminescence-based cell-based dose response screening assay to identify agonists of the Liver-X-Receptor (LXR)
EC50 67554±n/a nM
Citation PubChem, PC Counterscreen for agonists of the daf-12 abnormal Dauer Formation: Luminescence-based cell-based dose response screening assay to identify agonists of the Liver-X-Receptor (LXR) PubChem Bioassay(2013)[AID]
 
Oxysterols receptor LXR-beta
Name:Oxysterols receptor LXR-beta
Type:Enzyme Catalytic Domain
Mol. Mass.:50978.79
Organism:Homo sapiens (Human)
Description:P55055
Residue:460
BDBM37183
NameBDBM37183
Synonyms:3-(4-hydroxyphenyl)-5-oxidanyl-7-propan-2-yloxy-chromen-4-one 5-hydroxy-3-(4-hydroxyphenyl)-7-propan-2-yloxy-1-benzopyran-4-one MLS000115520 cid_5308744
TypeSmall organic molecule
Emp. Form.C18H16O5
Mol. Mass.312.3166
SMILESCC(C)Oc1cc(O)c2c(c1)occ(-c1ccc(O)cc1)c2=O