Reaction Details
TargetOxysterols receptor LXR-beta
LigandBDBM114972
Substrate/Competitorn/a
Meas. Tech.Counterscreen for agonists of the daf-12 abnormal Dauer Formation: Luminescence-based cell-based dose response screening assay to identify agonists of the Liver-X-Receptor (LXR)
EC50 67537±n/a nM
Citation PubChem, PC Counterscreen for agonists of the daf-12 abnormal Dauer Formation: Luminescence-based cell-based dose response screening assay to identify agonists of the Liver-X-Receptor (LXR) PubChem Bioassay(2013)[AID]
 
Oxysterols receptor LXR-beta
Name:Oxysterols receptor LXR-beta
Type:Enzyme Catalytic Domain
Mol. Mass.:50978.79
Organism:Homo sapiens (Human)
Description:P55055
Residue:460
BDBM114972
NameBDBM114972
Synonyms:MLS000102794 N-[2-methyl-5-(2-thiazolo[5,4-b]pyridinyl)phenyl]ethanesulfonamide SMR000018258 | cid_5310341
TypeSmall organic molecule
Emp. Form.C15H15N3O2S2
Mol. Mass.333.429
SMILESCCS(=O)(=O)Nc1cc(ccc1C)-c1nc2cccnc2s1