Reaction Details
TargetOxysterols receptor LXR-beta
LigandBDBM49423
Substrate/Competitorn/a
Meas. Tech.Counterscreen for agonists of the daf-12 abnormal Dauer Formation: Luminescence-based cell-based dose response screening assay to identify agonists of the Liver-X-Receptor (LXR)
EC50 67529±n/a nM
Citation PubChem, PC Counterscreen for agonists of the daf-12 abnormal Dauer Formation: Luminescence-based cell-based dose response screening assay to identify agonists of the Liver-X-Receptor (LXR) PubChem Bioassay(2013)[AID]
 
Oxysterols receptor LXR-beta
Name:Oxysterols receptor LXR-beta
Type:Enzyme Catalytic Domain
Mol. Mass.:50978.79
Organism:Homo sapiens (Human)
Description:P55055
Residue:460
BDBM49423
NameBDBM49423
Synonyms:(E)-3-(3,4-dimethylanilino)-2-(3-thienyl)acrylonitrile (E)-3-(3,4-dimethylanilino)-2-thiophen-3-ylprop-2-enenitrile MLS000539447 cid_2766393
TypeSmall organic molecule
Emp. Form.C15H14N2S
Mol. Mass.254.35
SMILESCc1ccc(cc1C)N=CC(C#N)c1ccsc1