Reaction Details
TargetOxysterols receptor LXR-beta
LigandBDBM114982
Substrate/Competitorn/a
Meas. Tech.Counterscreen for agonists of the daf-12 abnormal Dauer Formation: Luminescence-based cell-based dose response screening assay to identify agonists of the Liver-X-Receptor (LXR)
EC50 67595±n/a nM
Citation PubChem, PC Counterscreen for agonists of the daf-12 abnormal Dauer Formation: Luminescence-based cell-based dose response screening assay to identify agonists of the Liver-X-Receptor (LXR) PubChem Bioassay(2013)[AID]
 
Oxysterols receptor LXR-beta
Name:Oxysterols receptor LXR-beta
Type:Enzyme Catalytic Domain
Mol. Mass.:50978.79
Organism:Homo sapiens (Human)
Description:P55055
Residue:460
BDBM114982
NameBDBM114982
Synonyms:5-Isopropyl-2H-pyrazole-3-carboxylic acid [1-thiophen-2-yl-eth-(Z)-ylidene]-hydrazide 5-propan-2-yl-N-[(Z)-1-thiophen-2-ylethylideneamino]-1H-pyrazole-3-carboxamide SMR000147810 | cid_5782679
TypeSmall organic molecule
Emp. Form.C13H16N4OS
Mol. Mass.276.357
SMILESCC(C)c1cc([nH]n1)C(=O)NN=C(C)c1cccs1