Reaction Details
TargetOxysterols receptor LXR-beta
LigandBDBM76427
Substrate/Competitorn/a
Meas. Tech.Counterscreen for agonists of the daf-12 abnormal Dauer Formation: Luminescence-based cell-based dose response screening assay to identify agonists of the Liver-X-Receptor (LXR)
EC50 67531±n/a nM
Citation PubChem, PC Counterscreen for agonists of the daf-12 abnormal Dauer Formation: Luminescence-based cell-based dose response screening assay to identify agonists of the Liver-X-Receptor (LXR) PubChem Bioassay(2013)[AID]
 
Oxysterols receptor LXR-beta
Name:Oxysterols receptor LXR-beta
Type:Enzyme Catalytic Domain
Mol. Mass.:50978.79
Organism:Homo sapiens (Human)
Description:P55055
Residue:460
BDBM76427
NameBDBM76427
Synonyms:MLS000326042 N'-[3-chloro-5-(trifluoromethyl)-2-pyridinyl]-N-(3-nitro-2-pyridinyl)ethane-1,2-diamine N~1~-[3-chloro-5-(trifluoromethyl)-2-pyridinyl]-N~2~-(3-nitro-2-pyridinyl)-1,2-ethanediamine [3-chloro-5-(trifluoromethyl)-2-pyridyl]-[2-[(3-nitro-2-pyridyl)amino]ethyl]amine | cid_3773884
TypeSmall organic molecule
Emp. Form.C13H11ClF3N5O2
Mol. Mass.361.707
SMILES[O-][N+](=O)c1cccnc1NCCNc1ncc(cc1Cl)C(F)(F)F