Reaction Details
TargetOxysterols receptor LXR-beta
LigandBDBM114988
Substrate/Competitorn/a
Meas. Tech.Counterscreen for agonists of the daf-12 abnormal Dauer Formation: Luminescence-based cell-based dose response screening assay to identify agonists of the Liver-X-Receptor (LXR)
EC50 67554±n/a nM
Citation PubChem, PC Counterscreen for agonists of the daf-12 abnormal Dauer Formation: Luminescence-based cell-based dose response screening assay to identify agonists of the Liver-X-Receptor (LXR) PubChem Bioassay(2013)[AID]
 
Oxysterols receptor LXR-beta
Name:Oxysterols receptor LXR-beta
Type:Enzyme Catalytic Domain
Mol. Mass.:50978.79
Organism:Homo sapiens (Human)
Description:P55055
Residue:460
BDBM114988
NameBDBM114988
Synonyms:2,3,4,7,8,9,10,11-octahydro-1H-[1]benzothieno[2,3-b]cyclohepta[e]pyridin-12-amine SMR000186910 | cid_744115
TypeSmall organic molecule
Emp. Form.C16H20N2S
Mol. Mass.272.408
SMILESNc1c2CCCCCc2nc2sc3CCCCc3c12