Reaction Details
TargetOxysterols receptor LXR-beta
LigandBDBM76463
Substrate/Competitorn/a
Meas. Tech.Counterscreen for agonists of the daf-12 abnormal Dauer Formation: Luminescence-based cell-based dose response screening assay to identify agonists of the Liver-X-Receptor (LXR)
EC50 67516±n/a nM
Citation PubChem, PC Counterscreen for agonists of the daf-12 abnormal Dauer Formation: Luminescence-based cell-based dose response screening assay to identify agonists of the Liver-X-Receptor (LXR) PubChem Bioassay(2013)[AID]
 
Oxysterols receptor LXR-beta
Name:Oxysterols receptor LXR-beta
Type:Enzyme Catalytic Domain
Mol. Mass.:50978.79
Organism:Homo sapiens (Human)
Description:P55055
Residue:460
BDBM76463
NameBDBM76463
Synonyms:4-Methyl-5-phenyl-thiophene-3-carboxylic acid phenylamide 4-methyl-N,5-diphenyl-thiophene-3-carboxamide MLS000564604 cid_829294
TypeSmall organic molecule
Emp. Form.C18H15NOS
Mol. Mass.293.383
SMILESCc1c(csc1-c1ccccc1)C(=O)Nc1ccccc1