Reaction Details
TargetOxysterols receptor LXR-beta
LigandBDBM114852
Substrate/Competitorn/a
Meas. Tech.Counterscreen for agonists of the daf-12 abnormal Dauer Formation: Luminescence-based cell-based dose response screening assay to identify agonists of the Liver-X-Receptor (LXR)
EC50 67537±n/a nM
Citation PubChem, PC Counterscreen for agonists of the daf-12 abnormal Dauer Formation: Luminescence-based cell-based dose response screening assay to identify agonists of the Liver-X-Receptor (LXR) PubChem Bioassay(2013)[AID]
 
Oxysterols receptor LXR-beta
Name:Oxysterols receptor LXR-beta
Type:Enzyme Catalytic Domain
Mol. Mass.:50978.79
Organism:Homo sapiens (Human)
Description:P55055
Residue:460
BDBM114852
NameBDBM114852
Synonyms:(2E)-2-(2-thenylidene)benzo[e]benzothiophen-1-one (2E)-2-(thiophen-2-ylmethylidene)-1-benzo[e][1]benzothiolone MLS000584663 cid_12004806
TypeSmall organic molecule
Emp. Form.C17H10OS2
Mol. Mass.294.391
SMILESO=C1\C(Sc2ccc3ccccc3c12)=C/c1cccs1