Reaction Details
TargetOxysterols receptor LXR-beta
LigandBDBM83558
Substrate/Competitorn/a
Meas. Tech.Counterscreen for agonists of the daf-12 abnormal Dauer Formation: Luminescence-based cell-based dose response screening assay to identify agonists of the Liver-X-Receptor (LXR)
EC50 67554±n/a nM
Citation PubChem, PC Counterscreen for agonists of the daf-12 abnormal Dauer Formation: Luminescence-based cell-based dose response screening assay to identify agonists of the Liver-X-Receptor (LXR) PubChem Bioassay(2013)[AID]
 
Oxysterols receptor LXR-beta
Name:Oxysterols receptor LXR-beta
Type:Enzyme Catalytic Domain
Mol. Mass.:50978.79
Organism:Homo sapiens (Human)
Description:P55055
Residue:460
BDBM83558
NameBDBM83558
Synonyms:1-[4-[(4-chlorobenzyl)amino]-3-nitro-phenyl]-3-methyl-pyrrolidine-2,5-quinone 1-[4-[(4-chlorophenyl)methylamino]-3-nitrophenyl]-3-methylpyrrolidine-2,5-dione MLS000584616 cid_12005260
TypeSmall organic molecule
Emp. Form.C18H16ClN3O4
Mol. Mass.373.79
SMILESCc1cc(O)n(c1O)-c1ccc(NCc2ccc(Cl)cc2)c(c1)[N+]([O-])=O