Reaction Details
TargetOxysterols receptor LXR-beta
LigandBDBM114994
Substrate/Competitorn/a
Meas. Tech.Counterscreen for agonists of the daf-12 abnormal Dauer Formation: Luminescence-based cell-based dose response screening assay to identify agonists of the Liver-X-Receptor (LXR)
EC50 67561±n/a nM
Citation PubChem, PC Counterscreen for agonists of the daf-12 abnormal Dauer Formation: Luminescence-based cell-based dose response screening assay to identify agonists of the Liver-X-Receptor (LXR) PubChem Bioassay(2013)[AID]
 
Oxysterols receptor LXR-beta
Name:Oxysterols receptor LXR-beta
Type:Enzyme Catalytic Domain
Mol. Mass.:50978.79
Organism:Homo sapiens (Human)
Description:P55055
Residue:460
BDBM114994
NameBDBM114994
Synonyms:MLS000589024 N-[(E)-(5-methyl-2-thiophenyl)methylideneamino]-2-pyridinecarboxamide Pyridine-2-carboxylic acid [1-(5-methyl-thiophen-2-yl)-meth-(E)-ylidene]-hydrazide cid_6878933
TypeSmall organic molecule
Emp. Form.C12H11N3OS
Mol. Mass.245.3
SMILESCc1ccc(\C=N\NC(=O)c2ccccn2)s1