Reaction Details
TargetOxysterols receptor LXR-beta
LigandBDBM114995
Substrate/Competitorn/a
Meas. Tech.Counterscreen for agonists of the daf-12 abnormal Dauer Formation: Luminescence-based cell-based dose response screening assay to identify agonists of the Liver-X-Receptor (LXR)
EC50 67608±n/a nM
Citation PubChem, PC Counterscreen for agonists of the daf-12 abnormal Dauer Formation: Luminescence-based cell-based dose response screening assay to identify agonists of the Liver-X-Receptor (LXR) PubChem Bioassay(2013)[AID]
 
Oxysterols receptor LXR-beta
Name:Oxysterols receptor LXR-beta
Type:Enzyme Catalytic Domain
Mol. Mass.:50978.79
Organism:Homo sapiens (Human)
Description:P55055
Residue:460
BDBM114995
NameBDBM114995
Synonyms:2-Methyl-furan-3-carboxylic acid [1-(5-methyl-thiophen-2-yl)-meth-(E)-ylidene]-hydrazide 2-methyl-N-[(E)-(5-methyl-2-thiophenyl)methylideneamino]-3-furancarboxamide MLS000591098 cid_6886797
TypeSmall organic molecule
Emp. Form.C12H12N2O2S
Mol. Mass.248.301
SMILESCc1ccc(\C=N\NC(=O)c2ccoc2C)s1