Reaction Details
TargetOxysterols receptor LXR-beta
LigandBDBM114997
Substrate/Competitorn/a
Meas. Tech.Counterscreen for agonists of the daf-12 abnormal Dauer Formation: Luminescence-based cell-based dose response screening assay to identify agonists of the Liver-X-Receptor (LXR)
EC50 67622±n/a nM
Citation PubChem, PC Counterscreen for agonists of the daf-12 abnormal Dauer Formation: Luminescence-based cell-based dose response screening assay to identify agonists of the Liver-X-Receptor (LXR) PubChem Bioassay(2013)[AID]
 
Oxysterols receptor LXR-beta
Name:Oxysterols receptor LXR-beta
Type:Enzyme Catalytic Domain
Mol. Mass.:50978.79
Organism:Homo sapiens (Human)
Description:P55055
Residue:460
BDBM114997
NameBDBM114997
Synonyms:MLS000698346 N'-[(Z)-(2-methoxyphenyl)methylideneamino]-2-pyridinecarboximidamide N'-[(Z)-o-anisylideneamino]picolinamidine cid_5568682
TypeSmall organic molecule
Emp. Form.C14H14N4O
Mol. Mass.254.2872
SMILESCOc1ccccc1C=NN=C(N)c1ccccn1