Reaction Details
TargetOxysterols receptor LXR-beta
LigandBDBM114998
Substrate/Competitorn/a
Meas. Tech.Counterscreen for agonists of the daf-12 abnormal Dauer Formation: Luminescence-based cell-based dose response screening assay to identify agonists of the Liver-X-Receptor (LXR)
EC50 67554±n/a nM
Citation PubChem, PC Counterscreen for agonists of the daf-12 abnormal Dauer Formation: Luminescence-based cell-based dose response screening assay to identify agonists of the Liver-X-Receptor (LXR) PubChem Bioassay(2013)[AID]
 
Oxysterols receptor LXR-beta
Name:Oxysterols receptor LXR-beta
Type:Enzyme Catalytic Domain
Mol. Mass.:50978.79
Organism:Homo sapiens (Human)
Description:P55055
Residue:460
BDBM114998
NameBDBM114998
Synonyms:6-(4-bromanyl-3,5-dimethyl-pyrazol-1-yl)-N-cyclohexyl-1,2,4,5-tetrazin-3-amine 6-(4-bromo-3,5-dimethylpyrazol-1-yl)-N-cyclohexyl-1,2,4,5-tetrazin-3-amine N-[6-(4-bromo-3,5-dimethyl-1H-pyrazol-1-yl)-1,2,4,5-tetraazin-3-yl]-N-cyclohexylamine [6-(4-bromo-3,5-dimethyl-pyrazol-1-yl)-1,2,4,5-tetrazin-3-yl]-cyclohexyl-amine | cid_5113181
TypeSmall organic molecule
Emp. Form.C13H18BrN7
Mol. Mass.352.233
SMILESCc1nn(c(C)c1Br)-c1nnc(NC2CCCCC2)nn1