Reaction Details
TargetOxysterols receptor LXR-beta
LigandBDBM115001
Substrate/Competitorn/a
Meas. Tech.Counterscreen for agonists of the daf-12 abnormal Dauer Formation: Luminescence-based cell-based dose response screening assay to identify agonists of the Liver-X-Receptor (LXR)
EC50 67518±n/a nM
Citation PubChem, PC Counterscreen for agonists of the daf-12 abnormal Dauer Formation: Luminescence-based cell-based dose response screening assay to identify agonists of the Liver-X-Receptor (LXR) PubChem Bioassay(2013)[AID]
 
Oxysterols receptor LXR-beta
Name:Oxysterols receptor LXR-beta
Type:Enzyme Catalytic Domain
Mol. Mass.:50978.79
Organism:Homo sapiens (Human)
Description:P55055
Residue:460
BDBM115001
NameBDBM115001
Synonyms:3-[(2-fluorophenyl)sulfanylmethyl]-1,2,3-benzotriazin-4-one MLS000388902 cid_2591914
TypeSmall organic molecule
Emp. Form.C14H10FN3OS
Mol. Mass.287.312
SMILESFc1ccccc1SCn1nnc2ccccc2c1=O