Reaction Details
TargetOxysterols receptor LXR-beta
LigandBDBM49680
Substrate/Competitorn/a
Meas. Tech.Counterscreen for agonists of the daf-12 abnormal Dauer Formation: Luminescence-based cell-based dose response screening assay to identify agonists of the Liver-X-Receptor (LXR)
EC50 67518±n/a nM
Citation PubChem, PC Counterscreen for agonists of the daf-12 abnormal Dauer Formation: Luminescence-based cell-based dose response screening assay to identify agonists of the Liver-X-Receptor (LXR) PubChem Bioassay(2013)[AID]
 
Oxysterols receptor LXR-beta
Name:Oxysterols receptor LXR-beta
Type:Enzyme Catalytic Domain
Mol. Mass.:50978.79
Organism:Homo sapiens (Human)
Description:P55055
Residue:460
BDBM49680
NameBDBM49680
Synonyms:2-chloranyl-5-[2-[(5-chloranyl-3-methyl-1-phenyl-pyrazol-4-yl)methylidene]hydrazinyl]benzoic acid 2-chloro-5-[(N'E)-N'-[(5-chloro-3-methyl-1-phenyl-pyrazol-4-yl)methylene]hydrazino]benzoic acid 2-chloro-5-[2-[(5-chloro-3-methyl-1-phenylpyrazol-4-yl)methylidene]hydrazinyl]benzoic acid MLS000417411 cid_4321955
TypeSmall organic molecule
Emp. Form.C18H14Cl2N4O2
Mol. Mass.389.235
SMILESCc1nn(c(Cl)c1CN=Nc1ccc(Cl)c(c1)C(O)=O)-c1ccccc1