Reaction Details
TargetOxysterols receptor LXR-beta
LigandBDBM115003
Substrate/Competitorn/a
Meas. Tech.Counterscreen for agonists of the daf-12 abnormal Dauer Formation: Luminescence-based cell-based dose response screening assay to identify agonists of the Liver-X-Receptor (LXR)
EC50 67568±n/a nM
Citation PubChem, PC Counterscreen for agonists of the daf-12 abnormal Dauer Formation: Luminescence-based cell-based dose response screening assay to identify agonists of the Liver-X-Receptor (LXR) PubChem Bioassay(2013)[AID]
 
Oxysterols receptor LXR-beta
Name:Oxysterols receptor LXR-beta
Type:Enzyme Catalytic Domain
Mol. Mass.:50978.79
Organism:Homo sapiens (Human)
Description:P55055
Residue:460
BDBM115003
NameBDBM115003
Synonyms:2,6-bis(3-methyl-1-pyrazolyl)pyridine 2,6-bis(3-methylpyrazol-1-yl)pyridine SMR000229839 | cid_850137
TypeSmall organic molecule
Emp. Form.C13H13N5
Mol. Mass.239.2758
SMILESCc1ccn(n1)-c1cccc(n1)-n1ccc(C)n1